make -C argobots
make[1]: Entering directory '/media/sf_EFFORT/VARIOUS_SW/GLT/src/argobots'
gcc -fPIC -I. -I/usr/local/include -L/usr/local/lib64 -labt    -c -o glt.o glt.c
In file included from ./glt.h:51:0,
                 from glt.c:7:
./glt_common.h:87:24: error: unknown type name ‘ABT_event_kind’; did you mean ‘GLT_event_kind’?
 #define GLT_event_kind ABT_event_kind
                        ^
./glt.h:608:28: note: in expansion of macro ‘GLT_event_kind’
 void glt_event_add_callbac(GLT_event_kind event, GLT_event_cb_fn ask_cb,
                            ^~~~~~~~~~~~~~
./glt_common.h:88:25: error: unknown type name ‘ABT_event_cb_fn’; did you mean ‘GLT_event_cb_fn’?
 #define GLT_event_cb_fn ABT_event_cb_fn
                         ^
./glt.h:608:50: note: in expansion of macro ‘GLT_event_cb_fn’
 void glt_event_add_callbac(GLT_event_kind event, GLT_event_cb_fn ask_cb,
                                                  ^~~~~~~~~~~~~~~
./glt_common.h:88:25: error: unknown type name ‘ABT_event_cb_fn’; did you mean ‘GLT_event_cb_fn’?
 #define GLT_event_cb_fn ABT_event_cb_fn
                         ^
./glt.h:609:29: note: in expansion of macro ‘GLT_event_cb_fn’
         void *ask_user_arg, GLT_event_cb_fn act_cb, void *act_user_arg,
                             ^~~~~~~~~~~~~~~
./glt_common.h:87:24: error: unknown type name ‘ABT_event_kind’; did you mean ‘GLT_event_kind’?
 #define GLT_event_kind ABT_event_kind
                        ^
./glt.h:611:29: note: in expansion of macro ‘GLT_event_kind’
 void glt_event_del_callback(GLT_event_kind event, int cb_id);
                             ^~~~~~~~~~~~~~
In file included from ./glt.h:51:0,
                 from glt.c:7:
glt.c: In function ‘glt_init’:
glt.c:146:19: warning: implicit declaration of function ‘ABT_xstream_start’; did you mean ‘ABT_xstream_self’? [-Wimplicit-function-declaration]
             CHECK(ABT_xstream_start(main_team->team[i]),ABT_SUCCESS);
                   ^
./glt_common.h:126:4: note: in definition of macro ‘CHECK’
   (x); \
    ^
glt.c: In function ‘__kmp_abt_sched_run_es0’:
glt.c:185:21: warning: implicit declaration of function ‘time’; did you mean ‘times’? [-Wimplicit-function-declaration]
     unsigned seed = time(NULL);
                     ^~~~
                     times
make[1]: *** [<builtin>: glt.o] Error 1
make[1]: Leaving directory '/media/sf_EFFORT/VARIOUS_SW/GLT/src/argobots'
make: *** [Makefile:10: arg] Error 2
